{"text_format":"1","workbook":"xlsx","n_sheets":2,"sheets":["Sheet1","SUMMARY"],"not_rendered":{"charts":0,"images":1,"macros":1,"external_links":0,"defined_names":9,"comments":0,"pivot_tables":0},"unopened":[],"bounds":{"document_bytes":16777216,"sheet_cells":100000,"rows_first":2000,"rows_last":500,"rows_between":2000,"halvings":0,"cell_chars":16384,"cell_head_chars":4096},"cells_cut":0,"cells_raw":0,"read":"whole","date_system":"1900"}

{"sheet":"Sheet1","index":0,"n_rows":454,"n_cols":14,"rows_kept":454,"cut":false,"hidden":true,"merged":[]}
["ddConsortia","ddMember_range","Consortium","Consortium_Member","Key","Count","Member Name","15_16_member_allocation",null,"16_17_member_allocation",null,null,"Consortium Name","Consortium Short Name"]
["01 Allan Hancock",{"$f":"ADDRESS(MATCH(1,F:F,0),COLUMN(G1))&\":\"&ADDRESS(MATCH(MAX(F:F),F:F,0),COLUMN(G1))","v":"$G$361:$G$366"},"00 - XYZ Adult Education Consortium",{"$f":"C2&G2","v":"00 - XYZ Adult Education ConsortiumDr. Rufus T. Barleysheath Community College District"},"455_Dr. Rufus T. Barleysheath Community College District",{"$f":"IF(SUMMARY!$B$4=C2,MAX($F$1:F1)+1,\"n/a\")","v":"n/a"},"Dr. Rufus T. Barleysheath Community College District",100000,null,90000,null,null,"01 Allan Hancock","01 Allan Hancock"]
["02 Antelope Valley","member_key","00 - XYZ Adult Education Consortium","00 - XYZ Adult Education ConsortiumHappytown Unified School District","454_Happytown Unified School District",{"$f":"IF(SUMMARY!$B$4=C3,MAX($F$1:F2)+1,\"n/a\")","v":"n/a"},"Happytown Unified School District",75000,null,95000,null,null,"02 Antelope Valley","02 Antelope Valley"]
["03 Barstow",null,"00 - XYZ Adult Education Consortium","00 - XYZ Adult Education ConsortiumLake Town Unified School District","452_Lake Town Unified School District",{"$f":"IF(SUMMARY!$B$4=C4,MAX($F$1:F3)+1,\"n/a\")","v":"n/a"},"Lake Town Unified School District",100000,null,90000,null,null,"03 Barstow","03 Barstow"]
["04 Butte-Glenn","member_check","00 - XYZ Adult Education Consortium","00 - XYZ Adult Education ConsortiumMerplopin Regional Occupational Center","457_Merplopin Regional Occupational Center",{"$f":"IF(SUMMARY!$B$4=C5,MAX($F$1:F4)+1,\"n/a\")","v":"n/a"},"Merplopin Regional Occupational Center",90000,null,90000,null,null,"04 Butte-Glenn","04 Butte-Glenn"]
["05 Santa Cruz",null,"00 - XYZ Adult Education Consortium","00 - XYZ Adult Education ConsortiumPlunkerville Union School District","456_Plunkerville Union School District",{"$f":"IF(SUMMARY!$B$4=C6,MAX($F$1:F5)+1,\"n/a\")","v":"n/a"},"Plunkerville Union School District",300000,null,300000,null,null,"05 Santa Cruz","05 Santa Cruz"]
["06 Southeast Los Angeles","Submission Key (STATIC)","00 - XYZ Adult Education Consortium","00 - XYZ Adult Education ConsortiumSandwichville Unified School District","453_Sandwichville Unified School District",{"$f":"IF(SUMMARY!$B$4=C7,MAX($F$1:F6)+1,\"n/a\")","v":"n/a"},"Sandwichville Unified School District",200000,null,200000,null,null,"06 Southeast Los Angeles","06 PACE"]
["07 Mid Alameda County (Chabot-Las Positas)",{"$f":"SUBSTITUTE($B$16&\"_\"&TEXT(NOW(),\"yymmddhhmmss\"),\" \",\"-\")","v":"61-Sonoma_160909170347"},"00 - XYZ Adult Education Consortium","02 Antelope ValleySouthern Kern Unified School District","458_Smerpopolis County Office of Education",{"$f":"IF(SUMMARY!$B$4=C8,MAX($F$1:F7)+1,\"n/a\")","v":"n/a"},"Smerpopolis County Office of Education",90000,null,90000,null,null,"07 Mid Alameda County (Chabot-Las Positas)","07 Mid-Alameda"]
["08 West End Corridor","filename","01 Allan Hancock",{"$f":"C9&G9","v":"01 Allan HancockAllan Hancock Joint Community College District"},"448_Allan Hancock Joint Community College District",{"$f":"IF(SUMMARY!$B$4=C9,MAX($F$1:F8)+1,\"n/a\")","v":"n/a"},"Allan Hancock Joint Community College District",630850,630850,663431,663431,null,"08 West End Corridor","08 West End"]
["09 Citrus",{"$f":"MID(CELL(\"filename\"),SEARCH(\"[\",CELL(\"filename\"))+1,SEARCH(\"]\",CELL(\"filename\"))-SEARCH(\"[\",CELL(\"filename\"))-1)","v":"aebg_consortiumexpenditures_160722 (1).xlsm"},"01 Allan Hancock","01 Allan HancockLompoc Unified School District","95_Lompoc Unified School District",{"$f":"IF(SUMMARY!$B$4=C10,MAX($F$1:F9)+1,\"n/a\")","v":"n/a"},"Lompoc Unified School District",908755,908755,908755,908755,null,"09 Citrus","09 Citrus"]
["10 Coast",null,"01 Allan Hancock","01 Allan HancockSanta Barbara County Workforce Investment Board*","9_Santa Barbara County Workforce Investment Board*",{"$f":"IF(SUMMARY!$B$4=C11,MAX($F$1:F10)+1,\"n/a\")","v":"n/a"},"Santa Barbara County Workforce Investment Board*",0,0,0,0,null,"10 Coast","10 Coast"]
["11 Tri-Cities","Filename (Formula)","02 Antelope Valley","02 Antelope ValleyAntelope Valley Community College District","447_Antelope Valley Community College District",{"$f":"IF(SUMMARY!$B$4=C12,MAX($F$1:F11)+1,\"n/a\")","v":"n/a"},"Antelope Valley Community College District",0,0,0,0,null,"11 Tri-Cities","11 Tri-Cities"]
["12 Contra Costa",{"$f":"SUBSTITUTE($B$16,\" \",\"-\")&\"_\"&TEXT(NOW(),\"yymmddhhmmss\")","v":"61-Sonoma_160909170347"},"02 Antelope Valley","02 Antelope ValleyAntelope Valley Union High School District","279_Antelope Valley Union High School District",{"$f":"IF(SUMMARY!$B$4=C13,MAX($F$1:F12)+1,\"n/a\")","v":"n/a"},"Antelope Valley Union High School District",3712115,3712115,3758343,3758343,null,"12 Contra Costa","12 Contra Costa"]
["13 Morongo Basin",null,"02 Antelope Valley","02 Antelope ValleySouthern Kern Unified School District","302_Southern Kern Unified School District",{"$f":"IF(SUMMARY!$B$4=C14,MAX($F$1:F13)+1,\"n/a\")","v":"n/a"},"Southern Kern Unified School District",45390,45390,45390,45390,null,"13 Morongo Basin","13 Morongo Basin"]
["14 Desert","Filename (Trim)","03 Barstow","03 BarstowBaker Valley Unified School District","134_Baker Valley Unified School District",{"$f":"IF(SUMMARY!$B$4=C15,MAX($F$1:F14)+1,\"n/a\")","v":"n/a"},"Baker Valley Unified School District",115000,115000,108965,108965,null,"14 Desert","14 Desert"]
["15 South Bay (El Camino)",{"$f":"INDEX(N:N,MATCH(SUMMARY!B4,Sheet1!M:M,0))","v":"61 Sonoma"},"03 Barstow","03 BarstowBarstow Community College District","446_Barstow Community College District",{"$f":"IF(SUMMARY!$B$4=C16,MAX($F$1:F15)+1,\"n/a\")","v":"n/a"},"Barstow Community College District",0,0,0,0,null,"15 South Bay (El Camino)","15 SB-El Camino"]
["16 Feather River",null,"03 Barstow","03 BarstowBarstow Unified School District","146_Barstow Unified School District",{"$f":"IF(SUMMARY!$B$4=C17,MAX($F$1:F16)+1,\"n/a\")","v":"n/a"},"Barstow Unified School District",522308,522308,521959,521959,null,"16 Feather River","16 Feather River"]
["17 Foothill De Anza",null,"03 Barstow","03 BarstowSilver Valley Unified School District","133_Silver Valley Unified School District",{"$f":"IF(SUMMARY!$B$4=C18,MAX($F$1:F17)+1,\"n/a\")","v":"n/a"},"Silver Valley Unified School District",200000,200000,229400,229400,null,"17 Foothill De Anza","17 Foothill DeAnza"]
["18 Gavilan",null,"04 Butte-Glenn","04 Butte-GlennButte County Office of Education","360_Butte County Office of Education",{"$f":"IF(SUMMARY!$B$4=C19,MAX($F$1:F18)+1,\"n/a\")","v":"n/a"},"Butte County Office of Education",134617,134617,173251,173251,null,"18 Gavilan","18 Gavilan"]
["20 San Diego East (Grossmont-Cuyamaca)",null,"04 Butte-Glenn","04 Butte-GlennGlenn County Office of Education","323_Glenn County Office of Education",{"$f":"IF(SUMMARY!$B$4=C20,MAX($F$1:F19)+1,\"n/a\")","v":"n/a"},"Glenn County Office of Education",428322,428322,457775,457775,null,"20 San Diego East (Grossmont-Cuyamaca)","20 San Diego E"]
{"$rows_left_out":435}
{"sheet":"SUMMARY","index":1,"n_rows":263,"n_cols":23,"rows_kept":263,"cut":false,"hidden":false,"merged":[[37,11,37,17],[30,11,30,17],[8,11,9,18],[45,11,46,18],[157,11,158,18],[195,11,196,18],[233,11,234,18],[102,11,102,17],[10,1,10,2],[24,1,24,2],[12,1,12,2],[13,1,13,2],[14,1,14,2],[15,1,15,2],[16,1,16,2],[8,3,8,9],[9,3,9,5],[9,6,9,8],[9,9,10,9],[30,1,30,2],[31,1,31,2],[31,11,31,17],[32,1,32,2],[32,11,32,17],[11,1,11,2],[25,1,25,2],[26,1,26,2],[28,1,28,2],[28,11,28,17],[29,1,29,2],[29,11,29,17],[17,1,17,2],[18,1,18,2],[20,1,20,2],[21,1,21,2],[22,1,22,2],[23,1,23,2],[55,1,55,2],[57,1,57,2],[58,1,58,2],[59,1,59,2],[60,1,60,2],[1,3,1,18],[42,2,42,6],[50,1,50,2],[51,1,51,2],[52,1,52,2],[53,1,53,2],[54,1,54,2],[47,1,47,2],[48,1,48,2],[49,1,49,2],[3,1,3,4],[33,1,33,2],[33,11,33,17],[34,1,34,2],[34,11,34,17],[35,1,35,2],[35,11,35,17],[36,1,36,2],[36,11,36,17],[66,1,66,2],[66,11,66,17],[67,1,67,2],[67,11,67,17],[68,1,68,2],[68,11,68,17],[61,1,61,2],[62,1,62,2],[63,1,63,2],[65,1,65,2],[65,11,65,17],[72,1,72,2],[72,11,72,17],[73,1,73,2],[73,11,73,17],[74,11,74,17],[87,1,87,2],[69,1,69,2],[69,11,69,17],[70,1,70,2],[70,11,70,17],[71,1,71,2],[71,11,71,17],[88,1,88,2],[89,1,89,2],[90,1,90,2],[91,1,91,2],[84,1,84,2],[85,1,85,2],[86,1,86,2],[82,11,83,18],[79,2,79,6],[98,1,98,2],[99,1,99,2],[100,1,100,2],[102,1,102,2],[92,1,92,2],[94,1,94,2],[95,1,95,2],[96,1,96,2],[97,1,97,2],[106,1,106,2],[107,1,107,2],[108,1,108,2],[103,1,103,2],[104,1,104,2],[105,1,105,2],[121,9,122,9],[120,11,121,18],[117,2,117,6],[109,1,109,2],[110,1,110,2],[111,11,111,17],[103,11,103,17],[104,11,104,17],[105,11,105,17],[106,11,106,17],[107,11,107,17],[108,11,108,17],[109,11,109,17],[110,11,110,17],[126,1,126,2],[127,1,127,2],[128,1,128,2],[129,1,129,2],[122,1,122,2],[123,1,123,2],[124,1,124,2],[121,3,121,5],[121,6,121,8],[125,1,125,2],[136,1,136,2],[137,1,137,2],[138,1,138,2],[140,1,140,2],[140,11,140,17],[130,1,130,2],[132,1,132,2],[133,1,133,2],[134,1,134,2],[135,1,135,2],[155,14,155,15],[144,1,144,2],[144,11,144,17],[145,1,145,2],[145,11,145,17],[146,1,146,2],[146,11,146,17],[141,1,141,2],[141,11,141,17],[142,1,142,2],[142,11,142,17],[143,1,143,2],[143,11,143,17],[154,2,154,6],[147,1,147,2],[147,11,147,17],[148,1,148,2],[148,11,148,17],[149,11,149,17],[152,14,152,15],[153,14,153,15],[154,14,154,15],[163,1,163,2],[164,1,164,2],[165,1,165,2],[166,1,166,2],[159,1,159,2],[160,1,160,2],[161,1,161,2],[157,3,157,9],[158,3,158,5],[158,6,158,8],[158,9,159,9],[162,1,162,2],[173,1,173,2],[174,1,174,2],[175,1,175,2],[177,1,177,2],[177,11,177,17],[167,1,167,2],[169,1,169,2],[170,1,170,2],[171,1,171,2],[172,1,172,2],[193,14,193,15],[181,1,181,2],[181,11,181,17],[182,1,182,2],[182,11,182,17],[183,1,183,2],[183,11,183,17],[178,1,178,2],[178,11,178,17],[179,1,179,2],[179,11,179,17],[180,1,180,2],[180,11,180,17],[192,2,192,6],[184,1,184,2],[184,11,184,17],[185,1,185,2],[185,11,185,17],[186,11,186,17],[190,14,190,15],[191,14,191,15],[192,14,192,15],[201,1,201,2],[202,1,202,2],[203,1,203,2],[204,1,204,2],[197,1,197,2],[198,1,198,2],[199,1,199,2],[195,3,195,9],[196,3,196,5],[196,6,196,8],[196,9,197,9],[200,1,200,2],[211,1,211,2],[212,1,212,2],[213,1,213,2],[215,1,215,2],[215,11,215,17],[205,1,205,2],[207,1,207,2],[208,1,208,2],[209,1,209,2],[210,1,210,2],[231,14,231,15],[219,1,219,2],[219,11,219,17],[220,1,220,2],[220,11,220,17],[221,1,221,2],[221,11,221,17],[216,1,216,2],[216,11,216,17],[217,1,217,2],[217,11,217,17],[218,1,218,2],[218,11,218,17],[230,2,230,6],[222,1,222,2],[222,11,222,17],[223,1,223,2],[223,11,223,17],[224,11,224,17],[228,14,228,15],[229,14,229,15],[230,14,230,15],[239,1,239,2],[240,1,240,2],[241,1,241,2],[242,1,242,2],[235,1,235,2],[236,1,236,2],[237,1,237,2],[233,3,233,9],[234,3,234,5],[234,6,234,8],[234,9,235,9],[238,1,238,2],[249,1,249,2],[250,1,250,2],[251,1,251,2],[253,1,253,2],[253,11,253,17],[243,1,243,2],[245,1,245,2],[246,1,246,2],[247,1,247,2],[248,1,248,2],[257,1,257,2],[257,11,257,17],[258,1,258,2],[258,11,258,17],[259,1,259,2],[259,11,259,17],[254,1,254,2],[254,11,254,17],[255,1,255,2],[255,11,255,17],[256,1,256,2],[256,11,256,17],[260,1,260,2],[260,11,260,17],[261,1,261,2],[261,11,261,17],[262,11,262,17],[45,3,45,9],[46,3,46,5],[46,6,46,8],[46,9,47,9],[82,3,82,9],[83,3,83,5],[83,6,83,8],[83,9,84,9],[120,3,120,9],[3,14,3,15],[4,14,4,15],[5,14,5,15],[6,14,6,15],[40,14,40,15],[41,14,41,15],[42,14,42,15],[43,14,43,15],[77,14,77,15],[78,14,78,15],[79,14,79,15],[80,14,80,15],[115,14,115,15],[116,14,116,15],[117,14,117,15],[118,14,118,15]]}
[]
[null,"r3",null,"Consortium Expenditures Workbook"]
[null,null,null,null,null,null,null,null,null,null,null,null,null,null,null,null,"PY 15-16\nBudgeted","PY 15-16\nSpent","PY 16-17\nPlanned"]
[null,"61 Sonoma",null,null,null,null,null,null,null,null,null,null,null,null,"AEBG Funds",null,{"$f":"R4","v":2360435},{"$f":"SUMIFS(Sheet1!H:H,Sheet1!C:C,B4)","v":2360435},{"$f":"SUMIFS(Sheet1!J:J,Sheet1!C:C,B4)","v":2409227}]
[null,null,null,null,null,null,null,null,null,null,null,null,null,null,"Program Areas",null,{"$f":"IF(Q4=F19,\" - \",IF(Q4-F19>0,TEXT(Q4-F19,\"$#,###\")&\" ▼\",TEXT(ABS(Q4-F19),\"$#,###\")&\" ▲\"))","v":" - "},{"$f":"IF(I19=R4,\" - \",IF(R4-I19>0,TEXT(R4-I19,\"$#,###\")&\" ▼\",TEXT(ABS(R4-I19),\"$#,###\")&\" ▲\"))","v":"$1,357,662 ▼"},{"$f":"IF(L19=S4,\" - \",IF(S4-L19>0,TEXT(S4-L19,\"$#,###\")&\" ▼\",TEXT(ABS(S4-L19),\"$#,###\")&\" ▲\"))","v":" - "}]
[null,null,null,null,null,null,null,null,null,null,null,null,null,null,"Objectives",null,{"$f":"IF(F27=Q4,\" - \",IF(Q4-F27>0,TEXT(Q4-F27,\"$#,###\")&\" ▼\",TEXT(ABS(Q4-F27),\"$#,###\")&\" ▲\"))","v":" - "},{"$f":"IF(I27=R4,\" - \",IF(R4-I27>0,TEXT(R4-I27,\"$#,###\")&\" ▼\",TEXT(ABS(R4-I27),\"$#,###\")&\" ▲\"))","v":"$1,357,662 ▼"},{"$f":"IF(L27=S4,\" - \",IF(S4-L27>0,TEXT(S4-L27,\"$#,###\")&\" ▼\",TEXT(ABS(S4-L27),\"$#,###\")&\" ▲\"))","v":" - "}]
[null,null,null,null,null,null,null,null,null,null,null,null,null,null,"Object Codes",null,{"$f":"IF(F38=Q4,\" - \",IF(Q4-F38>0,TEXT(Q4-F38,\"$#,###\")&\" ▼\",TEXT(ABS(Q4-F38),\"$#,###\")&\" ▲\"))","v":"$1,270,486 ▼"},{"$f":"IF(I38=R4,\" - \",IF(R4-I38>0,TEXT(R4-I38,\"$#,###\")&\" ▼\",TEXT(ABS(R4-I38),\"$#,###\")&\" ▲\"))","v":"$2,128,148 ▼"}]
[]
[null,null,null,"2015 - 16 Expenditures",null,null,null,null,null,null,null,"2016 - 17 Planned Expenditures"]
[null,null,null,"Budgeted",null,null,"Spent",null,null,"+ / -"]
[null,"Program Areas",null,"MOE","Consortium Allocations","Total","MOE","Consortium Allocations","Total",null,null,"AEBG","WIOA","Adult Perkins","CalWorks","LCFF","CCD Apportionment","Incarcerated Adults","Total"]
[null,"3.1a Adult education (ABE, ASE, Basic Skills)",null,{"$f":"SUMIFS(D$49:D$264,$B$49:$B$264,$B12)","v":146840},{"$f":"SUMIFS(E$49:E$264,$B$49:$B$264,$B12)","v":527500},{"$f":"SUM(D12:E12)","v":674340},{"$f":"SUMIFS(G$49:G$264,$B$49:$B$264,$B12)","v":175000},{"$f":"SUMIFS(H$49:H$264,$B$49:$B$264,$B12)","v":35000},{"$f":"SUM(G12:H12)","v":210000},{"$f":"IF(F12-I12=0,0,IF(F12-I12>0,TEXT(ABS(F12-I12),\"$#,###\")&\" ▼\",TEXT(ABS(F12-I12),\"$#,###\")&\" ▲\"))","v":"$464,340 ▼"},null,{"$f":"SUMIFS(L$49:L$264,$B$49:$B$264,$B12)","v":675000},{"$f":"SUMIFS(M$49:M$264,$B$49:$B$264,$B12)","v":0},{"$f":"SUMIFS(N$49:N$264,$B$49:$B$264,$B12)","v":0},{"$f":"SUMIFS(O$49:O$264,$B$49:$B$264,$B12)","v":10000},{"$f":"SUMIFS(P$49:P$264,$B$49:$B$264,$B12)","v":0},{"$f":"SUMIFS(Q$49:Q$264,$B$49:$B$264,$B12)","v":2950436},{"$f":"SUMIFS(R$49:R$264,$B$49:$B$264,$B12)","v":20000},{"$f":"SUM(L12:R12)","v":3655436}]
[null,"3.1b English as a second language",null,{"$f":"SUMIFS(D$49:D$264,$B$49:$B$264,$B13)","v":217220},{"$f":"SUMIFS(E$49:E$264,$B$49:$B$264,$B13)","v":332500},{"$f":"SUM(D13:E13)","v":549720},{"$f":"SUMIFS(G$49:G$264,$B$49:$B$264,$B13)","v":217220},{"$f":"SUMIFS(H$49:H$264,$B$49:$B$264,$B13)","v":75000},{"$f":"SUM(G13:H13)","v":292220},{"$f":"IF(F13-I13=0,0,IF(F13-I13>0,TEXT(ABS(F13-I13),\"$#,###\")&\" ▼\",TEXT(ABS(F13-I13),\"$#,###\")&\" ▲\"))","v":"$257,500 ▼"},null,{"$f":"SUMIFS(L$49:L$264,$B$49:$B$264,$B13)","v":550000},{"$f":"SUMIFS(M$49:M$264,$B$49:$B$264,$B13)","v":379586},{"$f":"SUMIFS(N$49:N$264,$B$49:$B$264,$B13)","v":0},{"$f":"SUMIFS(O$49:O$264,$B$49:$B$264,$B13)","v":10000},{"$f":"SUMIFS(P$49:P$264,$B$49:$B$264,$B13)","v":0},{"$f":"SUMIFS(Q$49:Q$264,$B$49:$B$264,$B13)","v":2512610},{"$f":"SUMIFS(R$49:R$264,$B$49:$B$264,$B13)","v":0},3452196]
[null,"3.1c Pre-apprenticeship training",null,{"$f":"SUMIFS(D$49:D$264,$B$49:$B$264,$B14)","v":231924},{"$f":"SUMIFS(E$49:E$264,$B$49:$B$264,$B14)","v":40000},271924,{"$f":"SUMIFS(G$49:G$264,$B$49:$B$264,$B14)","v":200000},{"$f":"SUMIFS(H$49:H$264,$B$49:$B$264,$B14)","v":0},200000,"$71,924 ▼",null,{"$f":"SUMIFS(L$49:L$264,$B$49:$B$264,$B14)","v":170000},{"$f":"SUMIFS(M$49:M$264,$B$49:$B$264,$B14)","v":0},{"$f":"SUMIFS(N$49:N$264,$B$49:$B$264,$B14)","v":0},{"$f":"SUMIFS(O$49:O$264,$B$49:$B$264,$B14)","v":0},{"$f":"SUMIFS(P$49:P$264,$B$49:$B$264,$B14)","v":0},{"$f":"SUMIFS(Q$49:Q$264,$B$49:$B$264,$B14)","v":0},{"$f":"SUMIFS(R$49:R$264,$B$49:$B$264,$B14)","v":0},170000]
[null,"3.1d Career and technical training",null,{"$f":"SUMIFS(D$49:D$264,$B$49:$B$264,$B15)","v":134350},{"$f":"SUMIFS(E$49:E$264,$B$49:$B$264,$B15)","v":350000},484350,{"$f":"SUMIFS(G$49:G$264,$B$49:$B$264,$B15)","v":139920},{"$f":"SUMIFS(H$49:H$264,$B$49:$B$264,$B15)","v":106791},246711,"$237,639 ▼",null,{"$f":"SUMIFS(L$49:L$264,$B$49:$B$264,$B15)","v":644377},{"$f":"SUMIFS(M$49:M$264,$B$49:$B$264,$B15)","v":0},{"$f":"SUMIFS(N$49:N$264,$B$49:$B$264,$B15)","v":227076},{"$f":"SUMIFS(O$49:O$264,$B$49:$B$264,$B15)","v":5000},{"$f":"SUMIFS(P$49:P$264,$B$49:$B$264,$B15)","v":0},{"$f":"SUMIFS(Q$49:Q$264,$B$49:$B$264,$B15)","v":73476},{"$f":"SUMIFS(R$49:R$264,$B$49:$B$264,$B15)","v":60009},1009938]
[null,"3.1e Adults training to support child school success",null,{"$f":"SUMIFS(D$49:D$264,$B$49:$B$264,$B16)","v":20000},{"$f":"SUMIFS(E$49:E$264,$B$49:$B$264,$B16)","v":134949},154949,{"$f":"SUMIFS(G$49:G$264,$B$49:$B$264,$B16)","v":23346},{"$f":"SUMIFS(H$49:H$264,$B$49:$B$264,$B16)","v":5000},28346,"$126,603 ▼",null,{"$f":"SUMIFS(L$49:L$264,$B$49:$B$264,$B16)","v":175000},{"$f":"SUMIFS(M$49:M$264,$B$49:$B$264,$B16)","v":0},{"$f":"SUMIFS(N$49:N$264,$B$49:$B$264,$B16)","v":0},{"$f":"SUMIFS(O$49:O$264,$B$49:$B$264,$B16)","v":10916},{"$f":"SUMIFS(P$49:P$264,$B$49:$B$264,$B16)","v":0},{"$f":"SUMIFS(Q$49:Q$264,$B$49:$B$264,$B16)","v":0},{"$f":"SUMIFS(R$49:R$264,$B$49:$B$264,$B16)","v":0},185916]
[null,"3.1f Older adults in the workforce",null,{"$f":"SUMIFS(D$49:D$264,$B$49:$B$264,$B17)","v":20152},{"$f":"SUMIFS(E$49:E$264,$B$49:$B$264,$B17)","v":180000},200152,{"$f":"SUMIFS(G$49:G$264,$B$49:$B$264,$B17)","v":15000},{"$f":"SUMIFS(H$49:H$264,$B$49:$B$264,$B17)","v":10496},25496,"$174,656 ▼",null,{"$f":"SUMIFS(L$49:L$264,$B$49:$B$264,$B17)","v":169850},{"$f":"SUMIFS(M$49:M$264,$B$49:$B$264,$B17)","v":0},{"$f":"SUMIFS(N$49:N$264,$B$49:$B$264,$B17)","v":300000},{"$f":"SUMIFS(O$49:O$264,$B$49:$B$264,$B17)","v":4756},{"$f":"SUMIFS(P$49:P$264,$B$49:$B$264,$B17)","v":0},{"$f":"SUMIFS(Q$49:Q$264,$B$49:$B$264,$B17)","v":0},{"$f":"SUMIFS(R$49:R$264,$B$49:$B$264,$B17)","v":0},474606]
[null,"3.1g Services to adults with disabilities",null,{"$f":"SUMIFS(D$49:D$264,$B$49:$B$264,$B18)","v":0},{"$f":"SUMIFS(E$49:E$264,$B$49:$B$264,$B18)","v":25000},25000,{"$f":"SUMIFS(G$49:G$264,$B$49:$B$264,$B18)","v":0},{"$f":"SUMIFS(H$49:H$264,$B$49:$B$264,$B18)","v":0},0,"$25,000 ▼",null,{"$f":"SUMIFS(L$49:L$264,$B$49:$B$264,$B18)","v":25000},{"$f":"SUMIFS(M$49:M$264,$B$49:$B$264,$B18)","v":0},{"$f":"SUMIFS(N$49:N$264,$B$49:$B$264,$B18)","v":0},{"$f":"SUMIFS(O$49:O$264,$B$49:$B$264,$B18)","v":0},{"$f":"SUMIFS(P$49:P$264,$B$49:$B$264,$B18)","v":0},{"$f":"SUMIFS(Q$49:Q$264,$B$49:$B$264,$B18)","v":3235702},{"$f":"SUMIFS(R$49:R$264,$B$49:$B$264,$B18)","v":0},3260702]
[null,"Total",null,{"$f":"SUM(D12:D18)","v":770486},1589949,{"$f":"SUM(F12:F18)","v":2360435},{"$f":"SUM(G12:G18)","v":770486},{"$f":"SUM(H12:H18)","v":232287},{"$f":"SUM(I12:I18)","v":1002773},{"$f":"IF(F19-I19=0,0,IF(F19-I19>0,TEXT(ABS(F19-I19),\"$#,###\")&\" ▼\",TEXT(ABS(F19-I19),\"$#,###\")&\" ▲\"))","v":"$1,357,662 ▼"},null,{"$f":"SUM(L12:L18)","v":2409227},379586,527076,40672,0,8772224,80009,{"$f":"SUM(S12:S18)","v":12208794}]
[]
{"$rows_left_out":243}