{"text_format":"1","workbook":"xlsx","n_sheets":2,"sheets":["Sheet1","SUMMARY"],"not_rendered":{"charts":0,"images":1,"macros":1,"external_links":0,"defined_names":9,"comments":0,"pivot_tables":0},"unopened":[],"bounds":{"document_bytes":16777216,"sheet_cells":100000,"rows_first":2000,"rows_last":500,"rows_between":2000,"halvings":0,"cell_chars":16384,"cell_head_chars":4096},"cells_cut":0,"cells_raw":0,"read":"whole","date_system":"1900"}

{"sheet":"Sheet1","index":0,"n_rows":454,"n_cols":14,"rows_kept":454,"cut":false,"hidden":true,"merged":[]}
["ddConsortia","ddMember_range","Consortium","Consortium_Member","Key","Count","Member Name","15_16_member_allocation",null,"16_17_member_allocation",null,null,"Consortium Name","Consortium Short Name"]
["01 Allan Hancock",{"$f":"ADDRESS(MATCH(1,F:F,0),COLUMN(G1))&\":\"&ADDRESS(MATCH(MAX(F:F),F:F,0),COLUMN(G1))","v":"$G$138:$G$148"},"00 - XYZ Adult Education Consortium",{"$f":"C2&G2","v":"00 - XYZ Adult Education ConsortiumDr. Rufus T. Barleysheath Community College District"},"455_Dr. Rufus T. Barleysheath Community College District",{"$f":"IF(SUMMARY!$B$4=C2,MAX($F$1:F1)+1,\"n/a\")","v":"n/a"},"Dr. Rufus T. Barleysheath Community College District",100000,null,90000,null,null,"01 Allan Hancock","01 Allan Hancock"]
["02 Antelope Valley","member_key","00 - XYZ Adult Education Consortium","00 - XYZ Adult Education ConsortiumHappytown Unified School District","454_Happytown Unified School District",{"$f":"IF(SUMMARY!$B$4=C3,MAX($F$1:F2)+1,\"n/a\")","v":"n/a"},"Happytown Unified School District",75000,null,95000,null,null,"02 Antelope Valley","02 Antelope Valley"]
["03 Barstow",null,"00 - XYZ Adult Education Consortium","00 - XYZ Adult Education ConsortiumLake Town Unified School District","452_Lake Town Unified School District",{"$f":"IF(SUMMARY!$B$4=C4,MAX($F$1:F3)+1,\"n/a\")","v":"n/a"},"Lake Town Unified School District",100000,null,90000,null,null,"03 Barstow","03 Barstow"]
["04 Butte-Glenn","member_check","00 - XYZ Adult Education Consortium","00 - XYZ Adult Education ConsortiumMerplopin Regional Occupational Center","457_Merplopin Regional Occupational Center",{"$f":"IF(SUMMARY!$B$4=C5,MAX($F$1:F4)+1,\"n/a\")","v":"n/a"},"Merplopin Regional Occupational Center",90000,null,90000,null,null,"04 Butte-Glenn","04 Butte-Glenn"]
["05 Santa Cruz",null,"00 - XYZ Adult Education Consortium","00 - XYZ Adult Education ConsortiumPlunkerville Union School District","456_Plunkerville Union School District",{"$f":"IF(SUMMARY!$B$4=C6,MAX($F$1:F5)+1,\"n/a\")","v":"n/a"},"Plunkerville Union School District",300000,null,300000,null,null,"05 Santa Cruz","05 Santa Cruz"]
["06 Southeast Los Angeles","Submission Key (STATIC)","00 - XYZ Adult Education Consortium","00 - XYZ Adult Education ConsortiumSandwichville Unified School District","453_Sandwichville Unified School District",{"$f":"IF(SUMMARY!$B$4=C7,MAX($F$1:F6)+1,\"n/a\")","v":"n/a"},"Sandwichville Unified School District",200000,null,200000,null,null,"06 Southeast Los Angeles","06 PACE"]
["07 Mid Alameda County (Chabot-Las Positas)",{"$f":"SUBSTITUTE($B$16&\"_\"&TEXT(NOW(),\"yymmddhhmmss\"),\" \",\"-\")","v":"25-Lassen_160822173811"},"00 - XYZ Adult Education Consortium","02 Antelope ValleySouthern Kern Unified School District","458_Smerpopolis County Office of Education",{"$f":"IF(SUMMARY!$B$4=C8,MAX($F$1:F7)+1,\"n/a\")","v":"n/a"},"Smerpopolis County Office of Education",90000,null,90000,null,null,"07 Mid Alameda County (Chabot-Las Positas)","07 Mid-Alameda"]
["08 West End Corridor","filename","01 Allan Hancock",{"$f":"C9&G9","v":"01 Allan HancockAllan Hancock Joint Community College District"},"448_Allan Hancock Joint Community College District",{"$f":"IF(SUMMARY!$B$4=C9,MAX($F$1:F8)+1,\"n/a\")","v":"n/a"},"Allan Hancock Joint Community College District",630850,630850,663431,663431,null,"08 West End Corridor","08 West End"]
["09 Citrus",{"$f":"MID(CELL(\"filename\"),SEARCH(\"[\",CELL(\"filename\"))+1,SEARCH(\"]\",CELL(\"filename\"))-SEARCH(\"[\",CELL(\"filename\"))-1)","v":"All Schools Lassen Consortium Expenditures.xlsm"},"01 Allan Hancock","01 Allan HancockLompoc Unified School District","95_Lompoc Unified School District",{"$f":"IF(SUMMARY!$B$4=C10,MAX($F$1:F9)+1,\"n/a\")","v":"n/a"},"Lompoc Unified School District",908755,908755,908755,908755,null,"09 Citrus","09 Citrus"]
["10 Coast",null,"01 Allan Hancock","01 Allan HancockSanta Barbara County Workforce Investment Board*","9_Santa Barbara County Workforce Investment Board*",{"$f":"IF(SUMMARY!$B$4=C11,MAX($F$1:F10)+1,\"n/a\")","v":"n/a"},"Santa Barbara County Workforce Investment Board*",0,0,0,0,null,"10 Coast","10 Coast"]
["11 Tri-Cities","Filename (Formula)","02 Antelope Valley","02 Antelope ValleyAntelope Valley Community College District","447_Antelope Valley Community College District",{"$f":"IF(SUMMARY!$B$4=C12,MAX($F$1:F11)+1,\"n/a\")","v":"n/a"},"Antelope Valley Community College District",0,0,0,0,null,"11 Tri-Cities","11 Tri-Cities"]
["12 Contra Costa",{"$f":"SUBSTITUTE($B$16,\" \",\"-\")&\"_\"&TEXT(NOW(),\"yymmddhhmmss\")","v":"25-Lassen_160822173811"},"02 Antelope Valley","02 Antelope ValleyAntelope Valley Union High School District","279_Antelope Valley Union High School District",{"$f":"IF(SUMMARY!$B$4=C13,MAX($F$1:F12)+1,\"n/a\")","v":"n/a"},"Antelope Valley Union High School District",3712115,3712115,3758343,3758343,null,"12 Contra Costa","12 Contra Costa"]
["13 Morongo Basin",null,"02 Antelope Valley","02 Antelope ValleySouthern Kern Unified School District","302_Southern Kern Unified School District",{"$f":"IF(SUMMARY!$B$4=C14,MAX($F$1:F13)+1,\"n/a\")","v":"n/a"},"Southern Kern Unified School District",45390,45390,45390,45390,null,"13 Morongo Basin","13 Morongo Basin"]
["14 Desert","Filename (Trim)","03 Barstow","03 BarstowBaker Valley Unified School District","134_Baker Valley Unified School District",{"$f":"IF(SUMMARY!$B$4=C15,MAX($F$1:F14)+1,\"n/a\")","v":"n/a"},"Baker Valley Unified School District",115000,115000,108965,108965,null,"14 Desert","14 Desert"]
["15 South Bay (El Camino)",{"$f":"INDEX(N:N,MATCH(SUMMARY!B4,Sheet1!M:M,0))","v":"25 Lassen"},"03 Barstow","03 BarstowBarstow Community College District","446_Barstow Community College District",{"$f":"IF(SUMMARY!$B$4=C16,MAX($F$1:F15)+1,\"n/a\")","v":"n/a"},"Barstow Community College District",0,0,0,0,null,"15 South Bay (El Camino)","15 SB-El Camino"]
["16 Feather River",null,"03 Barstow","03 BarstowBarstow Unified School District","146_Barstow Unified School District",{"$f":"IF(SUMMARY!$B$4=C17,MAX($F$1:F16)+1,\"n/a\")","v":"n/a"},"Barstow Unified School District",522308,522308,521959,521959,null,"16 Feather River","16 Feather River"]
["17 Foothill De Anza",null,"03 Barstow","03 BarstowSilver Valley Unified School District","133_Silver Valley Unified School District",{"$f":"IF(SUMMARY!$B$4=C18,MAX($F$1:F17)+1,\"n/a\")","v":"n/a"},"Silver Valley Unified School District",200000,200000,229400,229400,null,"17 Foothill De Anza","17 Foothill DeAnza"]
["18 Gavilan",null,"04 Butte-Glenn","04 Butte-GlennButte County Office of Education","360_Butte County Office of Education",{"$f":"IF(SUMMARY!$B$4=C19,MAX($F$1:F18)+1,\"n/a\")","v":"n/a"},"Butte County Office of Education",134617,134617,173251,173251,null,"18 Gavilan","18 Gavilan"]
["20 San Diego East (Grossmont-Cuyamaca)",null,"04 Butte-Glenn","04 Butte-GlennGlenn County Office of Education","323_Glenn County Office of Education",{"$f":"IF(SUMMARY!$B$4=C20,MAX($F$1:F19)+1,\"n/a\")","v":"n/a"},"Glenn County Office of Education",428322,428322,457775,457775,null,"20 San Diego East (Grossmont-Cuyamaca)","20 San Diego E"]
{"$rows_left_out":435}
{"sheet":"SUMMARY","index":1,"n_rows":782,"n_cols":23,"rows_kept":782,"cut":false,"hidden":false,"merged":[[37,11,37,17],[30,11,30,17],[8,11,9,18],[45,11,46,18],[157,11,158,18],[195,11,196,18],[233,11,234,18],[102,11,102,17],[10,1,10,2],[24,1,24,2],[12,1,12,2],[13,1,13,2],[14,1,14,2],[15,1,15,2],[16,1,16,2],[8,3,8,9],[9,3,9,5],[9,6,9,8],[9,9,10,9],[30,1,30,2],[31,1,31,2],[31,11,31,17],[32,1,32,2],[32,11,32,17],[11,1,11,2],[25,1,25,2],[26,1,26,2],[28,1,28,2],[28,11,28,17],[29,1,29,2],[29,11,29,17],[17,1,17,2],[18,1,18,2],[20,1,20,2],[21,1,21,2],[22,1,22,2],[23,1,23,2],[55,1,55,2],[57,1,57,2],[58,1,58,2],[59,1,59,2],[60,1,60,2],[1,3,1,18],[42,2,42,6],[50,1,50,2],[51,1,51,2],[52,1,52,2],[53,1,53,2],[54,1,54,2],[47,1,47,2],[48,1,48,2],[49,1,49,2],[3,1,3,4],[33,1,33,2],[33,11,33,17],[34,1,34,2],[34,11,34,17],[35,1,35,2],[35,11,35,17],[36,1,36,2],[36,11,36,17],[66,1,66,2],[66,11,66,17],[67,1,67,2],[67,11,67,17],[68,1,68,2],[68,11,68,17],[61,1,61,2],[62,1,62,2],[63,1,63,2],[65,1,65,2],[65,11,65,17],[72,1,72,2],[72,11,72,17],[73,1,73,2],[73,11,73,17],[74,11,74,17],[87,1,87,2],[69,1,69,2],[69,11,69,17],[70,1,70,2],[70,11,70,17],[71,1,71,2],[71,11,71,17],[88,1,88,2],[89,1,89,2],[90,1,90,2],[91,1,91,2],[84,1,84,2],[85,1,85,2],[86,1,86,2],[82,11,83,18],[79,2,79,6],[98,1,98,2],[99,1,99,2],[100,1,100,2],[102,1,102,2],[92,1,92,2],[94,1,94,2],[95,1,95,2],[96,1,96,2],[97,1,97,2],[106,1,106,2],[107,1,107,2],[108,1,108,2],[103,1,103,2],[104,1,104,2],[105,1,105,2],[121,9,122,9],[120,11,121,18],[117,2,117,6],[109,1,109,2],[110,1,110,2],[111,11,111,17],[103,11,103,17],[104,11,104,17],[105,11,105,17],[106,11,106,17],[107,11,107,17],[108,11,108,17],[109,11,109,17],[110,11,110,17],[126,1,126,2],[127,1,127,2],[128,1,128,2],[129,1,129,2],[122,1,122,2],[123,1,123,2],[124,1,124,2],[121,3,121,5],[121,6,121,8],[125,1,125,2],[136,1,136,2],[137,1,137,2],[138,1,138,2],[140,1,140,2],[140,11,140,17],[130,1,130,2],[132,1,132,2],[133,1,133,2],[134,1,134,2],[135,1,135,2],[155,14,155,15],[144,1,144,2],[144,11,144,17],[145,1,145,2],[145,11,145,17],[146,1,146,2],[146,11,146,17],[141,1,141,2],[141,11,141,17],[142,1,142,2],[142,11,142,17],[143,1,143,2],[143,11,143,17],[154,2,154,6],[147,1,147,2],[147,11,147,17],[148,1,148,2],[148,11,148,17],[149,11,149,17],[152,14,152,15],[153,14,153,15],[154,14,154,15],[163,1,163,2],[164,1,164,2],[165,1,165,2],[166,1,166,2],[159,1,159,2],[160,1,160,2],[161,1,161,2],[157,3,157,9],[158,3,158,5],[158,6,158,8],[158,9,159,9],[162,1,162,2],[173,1,173,2],[174,1,174,2],[175,1,175,2],[177,1,177,2],[177,11,177,17],[167,1,167,2],[169,1,169,2],[170,1,170,2],[171,1,171,2],[172,1,172,2],[193,14,193,15],[181,1,181,2],[181,11,181,17],[182,1,182,2],[182,11,182,17],[183,1,183,2],[183,11,183,17],[178,1,178,2],[178,11,178,17],[179,1,179,2],[179,11,179,17],[180,1,180,2],[180,11,180,17],[192,2,192,6],[184,1,184,2],[184,11,184,17],[185,1,185,2],[185,11,185,17],[186,11,186,17],[190,14,190,15],[191,14,191,15],[192,14,192,15],[201,1,201,2],[202,1,202,2],[203,1,203,2],[204,1,204,2],[197,1,197,2],[198,1,198,2],[199,1,199,2],[195,3,195,9],[196,3,196,5],[196,6,196,8],[196,9,197,9],[200,1,200,2],[211,1,211,2],[212,1,212,2],[213,1,213,2],[215,1,215,2],[215,11,215,17],[205,1,205,2],[207,1,207,2],[208,1,208,2],[209,1,209,2],[210,1,210,2],[231,14,231,15],[219,1,219,2],[219,11,219,17],[220,1,220,2],[220,11,220,17],[221,1,221,2],[221,11,221,17],[216,1,216,2],[216,11,216,17],[217,1,217,2],[217,11,217,17],[218,1,218,2],[218,11,218,17],[230,2,230,6],[222,1,222,2],[222,11,222,17],[223,1,223,2],[223,11,223,17],[224,11,224,17],[228,14,228,15],[229,14,229,15],[230,14,230,15],[239,1,239,2],[240,1,240,2],[241,1,241,2],[242,1,242,2],[235,1,235,2],[236,1,236,2],[237,1,237,2],[233,3,233,9],[234,3,234,5],[234,6,234,8],[234,9,235,9],[238,1,238,2],[249,1,249,2],[250,1,250,2],[251,1,251,2],[253,1,253,2],[253,11,253,17],[243,1,243,2],[245,1,245,2],[246,1,246,2],[247,1,247,2],[248,1,248,2],[268,14,268,15],[257,1,257,2],[257,11,257,17],[258,1,258,2],[258,11,258,17],[259,1,259,2],[259,11,259,17],[254,1,254,2],[254,11,254,17],[255,1,255,2],[255,11,255,17],[256,1,256,2],[256,11,256,17],[267,2,267,6],[260,1,260,2],[260,11,260,17],[261,1,261,2],[261,11,261,17],[262,11,262,17],[265,14,265,15],[266,14,266,15],[267,14,267,15],[276,1,276,2],[277,1,277,2],[278,1,278,2],[279,1,279,2],[272,1,272,2],[273,1,273,2],[274,1,274,2],[270,3,270,9],[271,3,271,5],[271,6,271,8],[271,9,272,9],[275,1,275,2],[286,1,286,2],[287,1,287,2],[288,1,288,2],[290,1,290,2],[290,11,290,17],[280,1,280,2],[282,1,282,2],[283,1,283,2],[284,1,284,2],[285,1,285,2],[294,1,294,2],[294,11,294,17],[295,1,295,2],[295,11,295,17],[296,1,296,2],[296,11,296,17],[291,1,291,2],[291,11,291,17],[292,1,292,2],[292,11,292,17],[293,1,293,2],[293,11,293,17],[304,2,304,6],[297,1,297,2],[297,11,297,17],[298,1,298,2],[298,11,298,17],[299,11,299,17],[302,14,302,15],[303,14,303,15],[304,14,304,15],[312,1,312,2],[313,1,313,2],[314,1,314,2],[315,1,315,2],[316,1,316,2],[309,1,309,2],[310,1,310,2],[311,1,311,2],[307,3,307,9],[308,3,308,5],[308,6,308,8],[308,9,309,9],[323,1,323,2],[324,1,324,2],[325,1,325,2],[327,1,327,2],[327,11,327,17],[317,1,317,2],[319,1,319,2],[320,1,320,2],[321,1,321,2],[322,1,322,2],[331,1,331,2],[331,11,331,17],[332,1,332,2],[332,11,332,17],[333,1,333,2],[333,11,333,17],[328,1,328,2],[328,11,328,17],[329,1,329,2],[329,11,329,17],[330,1,330,2],[330,11,330,17],[341,2,341,6],[334,1,334,2],[334,11,334,17],[335,1,335,2],[335,11,335,17],[336,11,336,17],[339,14,339,15],[340,14,340,15],[341,14,341,15],[349,1,349,2],[350,1,350,2],[351,1,351,2],[352,1,352,2],[353,1,353,2],[346,1,346,2],[347,1,347,2],[348,1,348,2],[344,3,344,9],[345,3,345,5],[345,6,345,8],[345,9,346,9],[360,1,360,2],[361,1,361,2],[362,1,362,2],[364,1,364,2],[364,11,364,17],[354,1,354,2],[356,1,356,2],[357,1,357,2],[358,1,358,2],[359,1,359,2],[368,1,368,2],[368,11,368,17],[369,1,369,2],[369,11,369,17],[370,1,370,2],[370,11,370,17],[365,1,365,2],[365,11,365,17],[366,1,366,2],[366,11,366,17],[367,1,367,2],[367,11,367,17],[383,1,383,2],[384,1,384,2],[385,1,385,2],[381,3,381,9],[382,3,382,5],[382,6,382,8],[382,9,383,9],[378,2,378,6],[371,1,371,2],[372,1,372,2],[391,1,391,2],[393,1,393,2],[394,1,394,2],[395,1,395,2],[396,1,396,2],[386,1,386,2],[387,1,387,2],[388,1,388,2],[389,1,389,2],[390,1,390,2],[402,1,402,2],[402,11,402,17],[403,1,403,2],[403,11,403,17],[404,1,404,2],[404,11,404,17],[397,1,397,2],[398,1,398,2],[399,1,399,2],[401,1,401,2],[401,11,401,17],[415,2,415,6],[408,1,408,2],[408,11,408,17],[409,1,409,2],[409,11,409,17],[410,11,410,17],[405,1,405,2],[405,11,405,17],[406,1,406,2],[406,11,406,17],[407,1,407,2],[407,11,407,17],[423,1,423,2],[424,1,424,2],[425,1,425,2],[426,1,426,2],[427,1,427,2],[420,1,420,2],[421,1,421,2],[422,1,422,2],[418,3,418,9],[419,3,419,5],[419,6,419,8],[419,9,420,9],[434,1,434,2],[435,1,435,2],[436,1,436,2],[438,1,438,2],[438,11,438,17],[428,1,428,2],[430,1,430,2],[431,1,431,2],[432,1,432,2],[433,1,433,2],[442,1,442,2],[442,11,442,17],[443,1,443,2],[443,11,443,17],[444,1,444,2],[444,11,444,17],[439,1,439,2],[439,11,439,17],[440,1,440,2],[440,11,440,17],[441,1,441,2],[441,11,441,17],[452,2,452,6],[445,1,445,2],[445,11,445,17],[446,1,446,2],[446,11,446,17],[447,11,447,17],[450,14,450,15],[451,14,451,15],[452,14,452,15],[460,1,460,2],[461,1,461,2],[462,1,462,2],[463,1,463,2],[464,1,464,2],[457,1,457,2],[458,1,458,2],[459,1,459,2],[455,3,455,9],[456,3,456,5],[456,6,456,8],[456,9,457,9],[471,1,471,2],[472,1,472,2],[473,1,473,2],[475,1,475,2],[465,1,465,2],[467,1,467,2],[468,1,468,2],[469,1,469,2],[470,1,470,2],[489,2,489,6],[482,1,482,2],[483,1,483,2],[479,1,479,2],[480,1,480,2],[481,1,481,2],[476,1,476,2],[477,1,477,2],[478,1,478,2],[497,1,497,2],[498,1,498,2],[499,1,499,2],[500,1,500,2],[501,1,501,2],[494,1,494,2],[495,1,495,2],[496,1,496,2],[492,3,492,9],[493,3,493,5],[493,6,493,8],[493,9,494,9],[513,1,513,2],[514,1,514,2],[515,1,515,2],[508,1,508,2],[509,1,509,2],[510,1,510,2],[512,1,512,2],[502,1,502,2],[504,1,504,2],[505,1,505,2],[506,1,506,2],[507,1,507,2],[526,2,526,6],[519,1,519,2],[520,1,520,2],[516,1,516,2],[517,1,517,2],[518,1,518,2],[517,11,517,17],[518,11,518,17],[519,11,519,17],[520,11,520,17],[521,11,521,17],[534,1,534,2],[535,1,535,2],[536,1,536,2],[537,1,537,2],[538,1,538,2],[531,1,531,2],[532,1,532,2],[533,1,533,2],[529,3,529,9],[530,3,530,5],[530,6,530,8],[530,9,531,9],[550,1,550,2],[551,1,551,2],[552,1,552,2],[545,1,545,2],[546,1,546,2],[547,1,547,2],[549,1,549,2],[539,1,539,2],[541,1,541,2],[542,1,542,2],[543,1,543,2],[544,1,544,2],[563,2,563,6],[556,1,556,2],[557,1,557,2],[553,1,553,2],[554,1,554,2],[555,1,555,2],[561,14,561,15],[562,14,562,15],[563,14,563,15],[558,11,558,17],[571,1,571,2],[572,1,572,2],[573,1,573,2],[574,1,574,2],[575,1,575,2],[568,1,568,2],[569,1,569,2],[570,1,570,2],[566,3,566,9],[567,3,567,5],[567,6,567,8],[567,9,568,9],[582,1,582,2],[583,1,583,2],[584,1,584,2],[586,1,586,2],[576,1,576,2],[578,1,578,2],[579,1,579,2],[580,1,580,2],[581,1,581,2],[600,2,600,6],[593,1,593,2],[594,1,594,2],[590,1,590,2],[591,1,591,2],[592,1,592,2],[587,1,587,2],[588,1,588,2],[589,1,589,2],[608,1,608,2],[609,1,609,2],[610,1,610,2],[611,1,611,2],[612,1,612,2],[605,1,605,2],[606,1,606,2],[607,1,607,2],[603,3,603,9],[604,3,604,5],[604,6,604,8],[604,9,605,9],[624,1,624,2],[625,1,625,2],[626,1,626,2],[619,1,619,2],[620,1,620,2],[621,1,621,2],[623,1,623,2],[613,1,613,2],[615,1,615,2],[616,1,616,2],[617,1,617,2],[618,1,618,2],[637,2,637,6],[630,1,630,2],[631,1,631,2],[627,1,627,2],[628,1,628,2],[629,1,629,2],[628,11,628,17],[629,11,629,17],[630,11,630,17],[631,11,631,17],[632,11,632,17],[645,1,645,2],[646,1,646,2],[647,1,647,2],[648,1,648,2],[649,1,649,2],[642,1,642,2],[643,1,643,2],[644,1,644,2],[640,3,640,9],[641,3,641,5],[641,6,641,8],[641,9,642,9],[661,1,661,2],[662,1,662,2],[663,1,663,2],[656,1,656,2],[657,1,657,2],[658,1,658,2],[660,1,660,2],[650,1,650,2],[652,1,652,2],[653,1,653,2],[654,1,654,2],[655,1,655,2],[674,2,674,6],[667,1,667,2],[668,1,668,2],[664,1,664,2],[665,1,665,2],[666,1,666,2],[672,14,672,15],[673,14,673,15],[674,14,674,15],[669,11,669,17],[682,1,682,2],[683,1,683,2],[684,1,684,2],[685,1,685,2],[686,1,686,2],[679,1,679,2],[680,1,680,2],[681,1,681,2],[677,3,677,9],[678,3,678,5],[678,6,678,8],[678,9,679,9],[693,1,693,2],[694,1,694,2],[695,1,695,2],[697,1,697,2],[687,1,687,2],[689,1,689,2],[690,1,690,2],[691,1,691,2],[692,1,692,2],[711,2,711,6],[704,1,704,2],[705,1,705,2],[701,1,701,2],[702,1,702,2],[703,1,703,2],[698,1,698,2],[699,1,699,2],[700,1,700,2],[719,1,719,2],[720,1,720,2],[721,1,721,2],[722,1,722,2],[723,1,723,2],[716,1,716,2],[717,1,717,2],[718,1,718,2],[714,3,714,9],[715,3,715,5],[715,6,715,8],[715,9,716,9],[735,1,735,2],[736,1,736,2],[737,1,737,2],[730,1,730,2],[731,1,731,2],[732,1,732,2],[734,1,734,2],[724,1,724,2],[726,1,726,2],[727,1,727,2],[728,1,728,2],[729,1,729,2],[752,11,753,18],[741,1,741,2],[742,1,742,2],[754,1,754,2],[755,1,755,2],[738,1,738,2],[739,1,739,2],[740,1,740,2],[739,11,739,17],[740,11,740,17],[741,11,741,17],[742,11,742,17],[743,11,743,17],[756,1,756,2],[749,2,749,6],[762,1,762,2],[764,1,764,2],[765,1,765,2],[766,1,766,2],[767,1,767,2],[757,1,757,2],[758,1,758,2],[759,1,759,2],[760,1,760,2],[761,1,761,2],[752,3,752,9],[753,3,753,5],[753,6,753,8],[753,9,754,9],[773,1,773,2],[774,1,774,2],[775,1,775,2],[768,1,768,2],[769,1,769,2],[770,1,770,2],[772,1,772,2],[779,1,779,2],[780,1,780,2],[776,1,776,2],[777,1,777,2],[778,1,778,2],[45,3,45,9],[46,3,46,5],[46,6,46,8],[46,9,47,9],[82,3,82,9],[83,3,83,5],[83,6,83,8],[83,9,84,9],[120,3,120,9],[3,14,3,15],[4,14,4,15],[5,14,5,15],[6,14,6,15],[40,14,40,15],[41,14,41,15],[42,14,42,15],[714,11,715,18],[677,11,678,18],[640,11,641,18],[603,11,604,18],[566,11,567,18],[529,11,530,18],[492,11,493,18],[455,11,456,18],[418,11,419,18],[381,11,382,18],[344,11,345,18],[371,11,371,17],[372,11,372,17],[373,11,373,17],[307,11,308,18],[305,14,305,15],[270,11,271,18],[43,14,43,15],[77,14,77,15],[78,14,78,15],[79,14,79,15],[80,14,80,15],[115,14,115,15],[116,14,116,15],[117,14,117,15],[118,14,118,15],[342,14,342,15],[376,14,376,15],[377,14,377,15],[378,14,378,15],[379,14,379,15],[413,14,413,15],[414,14,414,15],[415,14,415,15],[416,14,416,15],[453,14,453,15],[487,14,487,15],[488,14,488,15],[489,14,489,15],[490,14,490,15],[524,14,524,15],[525,14,525,15],[526,14,526,15],[527,14,527,15],[475,11,475,17],[476,11,476,17],[477,11,477,17],[478,11,478,17],[479,11,479,17],[480,11,480,17],[481,11,481,17],[482,11,482,17],[483,11,483,17],[484,11,484,17],[512,11,512,17],[513,11,513,17],[514,11,514,17],[515,11,515,17],[516,11,516,17],[564,14,564,15],[598,14,598,15],[599,14,599,15],[600,14,600,15],[601,14,601,15],[635,14,635,15],[636,14,636,15],[637,14,637,15],[638,14,638,15],[586,11,586,17],[587,11,587,17],[588,11,588,17],[589,11,589,17],[590,11,590,17],[591,11,591,17],[592,11,592,17],[593,11,593,17],[594,11,594,17],[595,11,595,17],[623,11,623,17],[624,11,624,17],[625,11,625,17],[626,11,626,17],[627,11,627,17],[675,14,675,15],[709,14,709,15],[710,14,710,15],[711,14,711,15],[712,14,712,15],[747,14,747,15],[748,14,748,15],[749,14,749,15],[750,14,750,15],[697,11,697,17],[698,11,698,17],[699,11,699,17],[700,11,700,17],[701,11,701,17],[702,11,702,17],[703,11,703,17],[704,11,704,17],[705,11,705,17],[706,11,706,17],[734,11,734,17],[735,11,735,17],[736,11,736,17],[737,11,737,17],[738,11,738,17],[549,11,549,17],[550,11,550,17],[551,11,551,17],[552,11,552,17],[553,11,553,17],[554,11,554,17],[555,11,555,17],[556,11,556,17],[557,11,557,17],[660,11,660,17],[661,11,661,17],[662,11,662,17],[663,11,663,17],[664,11,664,17],[665,11,665,17],[666,11,666,17],[667,11,667,17],[668,11,668,17],[781,11,781,17],[772,11,772,17],[773,11,773,17],[774,11,774,17],[775,11,775,17],[776,11,776,17],[777,11,777,17],[778,11,778,17],[779,11,779,17],[780,11,780,17]]}
[]
[null,"r3",null,"Consortium Expenditures Workbook"]
[null,null,null,null,null,null,null,null,null,null,null,null,null,null,null,null,"PY 15-16\nBudgeted","PY 15-16\nSpent","PY 16-17\nPlanned"]
[null,"25 Lassen",null,null,null,null,null,null,null,null,null,null,null,null,"AEBG Funds",null,{"$f":"R4","v":867080},{"$f":"SUMIFS(Sheet1!H:H,Sheet1!C:C,B4)","v":867080},{"$f":"SUMIFS(Sheet1!J:J,Sheet1!C:C,B4)","v":892858}]
[null,null,null,null,null,null,null,null,null,null,null,null,null,null,"Program Areas",null,{"$f":"IF(Q4=F19,\" - \",IF(Q4-F19>0,TEXT(Q4-F19,\"$#,###\")&\" ▼\",TEXT(ABS(Q4-F19),\"$#,###\")&\" ▲\"))","v":" - "},{"$f":"IF(I19=R4,\" - \",IF(R4-I19>0,TEXT(R4-I19,\"$#,###\")&\" ▼\",TEXT(ABS(R4-I19),\"$#,###\")&\" ▲\"))","v":"$726,840 ▼"},{"$f":"IF(L19=S4,\" - \",IF(S4-L19>0,TEXT(S4-L19,\"$#,###\")&\" ▼\",TEXT(ABS(S4-L19),\"$#,###\")&\" ▲\"))","v":"$2,500 ▲"}]
[null,null,null,null,null,null,null,null,null,null,null,null,null,null,"Objectives",null,{"$f":"IF(F27=Q4,\" - \",IF(Q4-F27>0,TEXT(Q4-F27,\"$#,###\")&\" ▼\",TEXT(ABS(Q4-F27),\"$#,###\")&\" ▲\"))","v":" - "},{"$f":"IF(I27=R4,\" - \",IF(R4-I27>0,TEXT(R4-I27,\"$#,###\")&\" ▼\",TEXT(ABS(R4-I27),\"$#,###\")&\" ▲\"))","v":"$724,557 ▼"},{"$f":"IF(L27=S4,\" - \",IF(S4-L27>0,TEXT(S4-L27,\"$#,###\")&\" ▼\",TEXT(ABS(S4-L27),\"$#,###\")&\" ▲\"))","v":"$2,500 ▲"}]
[null,null,null,null,null,null,null,null,null,null,null,null,null,null,"Object Codes",null,{"$f":"IF(F38=Q4,\" - \",IF(Q4-F38>0,TEXT(Q4-F38,\"$#,###\")&\" ▼\",TEXT(ABS(Q4-F38),\"$#,###\")&\" ▲\"))","v":"$190,516 ▼"},{"$f":"IF(I38=R4,\" - \",IF(R4-I38>0,TEXT(R4-I38,\"$#,###\")&\" ▼\",TEXT(ABS(R4-I38),\"$#,###\")&\" ▲\"))","v":"$564,210 ▼"}]
[]
[null,null,null,"2015 - 16 Expenditures",null,null,null,null,null,null,null,"2016 - 17 Planned Expenditures"]
[null,null,null,"Budgeted",null,null,"Spent",null,null,"+ / -"]
[null,"Program Areas",null,"MOE","Consortium Allocations","Total","MOE","Consortium Allocations","Total",null,null,"AEBG","WIOA","Adult Perkins","CalWorks","LCFF","CCD Apportionment","Incarcerated Adults","Total"]
[null,"3.1a Adult education (ABE, ASE, Basic Skills)",null,{"$f":"SUMIFS(D$49:D$782,$B$49:$B$782,$B12)","v":27080},835000,{"$f":"SUM(D12:E12)","v":862080},24941,115298.63,{"$f":"SUM(G12:H12)","v":140239.63},{"$f":"IF(F12-I12=0,0,IF(F12-I12>0,TEXT(ABS(F12-I12),\"$#,###\")&\" ▼\",TEXT(ABS(F12-I12),\"$#,###\")&\" ▲\"))","v":"$721,840 ▼"},null,{"$f":"SUMIFS(L$49:L$782,$B$49:$B$782,$B12)","v":883358},0,0,0,0,0,0,{"$f":"SUM(L12:R12)","v":883358}]
[null,"3.1b English as a second language",null,0,0,{"$f":"SUM(D13:E13)","v":0},0,0,{"$f":"SUM(G13:H13)","v":0},{"$f":"IF(F13-I13=0,0,IF(F13-I13>0,TEXT(ABS(F13-I13),\"$#,###\")&\" ▼\",TEXT(ABS(F13-I13),\"$#,###\")&\" ▲\"))","v":0},null,0,0,0,0,0,0,0,0]
[null,"3.1c Pre-apprenticeship training",null,0,0,0,0,0,0,0,null,0,0,0,0,0,0,0,0]
[null,"3.1d Career and technical training",null,0,5000,5000,0,0,0,"$5,000 ▼",null,12000,0,0,0,0,0,0,12000]
[null,"3.1e Adults training to support child school success",null,0,0,0,0,0,0,0,null,0,0,0,0,0,0,0,0]
[null,"3.1f Older adults in the workforce",null,0,0,0,0,0,0,0,null,0,0,0,0,0,0,0,0]
[null,"3.1g Services to adults with disabilities",null,0,0,0,0,0,0,0,null,0,0,0,0,0,0,0,0]
[null,"Total",null,{"$f":"SUM(D12:D18)","v":27080},840000,{"$f":"SUM(F12:F18)","v":867080},{"$f":"SUM(G12:G18)","v":24941},{"$f":"SUM(H12:H18)","v":115298.63},{"$f":"SUM(I12:I18)","v":140239.63},{"$f":"IF(F19-I19=0,0,IF(F19-I19>0,TEXT(ABS(F19-I19),\"$#,###\")&\" ▼\",TEXT(ABS(F19-I19),\"$#,###\")&\" ▲\"))","v":"$726,840 ▼"},null,{"$f":"SUM(L12:L18)","v":895358},0,0,0,0,0,0,{"$f":"SUM(S12:S18)","v":895358}]
[]
{"$rows_left_out":762}